{"text_format":"1","workbook":"xlsx","n_sheets":24,"sheets":["MES","MAIN","基本情報","入力情報(1)","入力情報(2)","メンテナンスレベル","プレビュー","マスター変更","参照表","取得金額計算","Master","Calc","経年故障率表","健全度","影響水量","損失額","修繕更新費用S1","修繕更新費用S2","修繕更新費用S3","修繕更新費用S4","修繕更新費用S5","出力まとめの表","系列の集計","設備費と運転費"],"not_rendered":{"charts":16,"images":46,"macros":1,"external_links":0,"defined_names":137,"comments":2,"pivot_tables":0},"unopened":[],"bounds":{"document_bytes":16777216,"sheet_cells":100000,"rows_first":2000,"rows_last":500,"rows_between":2000,"halvings":0,"cell_chars":16384,"cell_head_chars":4096},"cells_cut":0,"cells_raw":0,"read":"whole","date_system":"1900"}

{"sheet":"MES","index":0,"n_rows":283,"n_cols":12,"rows_kept":283,"cut":false,"hidden":false,"merged":[[1,11,1,13]]}
[]
[null,null,null,null,null,null,null,null,null,null,null,"メインメニューへ戻る"]
[]
[]
[]
[null,null,"★マクロを有効にしてファイルを開く方法★"]
[]
[]
[null,null,"　マクロを有効にしてファイルを開くことが出来ない場合、以下の設定をして下さい。。"]
[]
{"$rows_left_out":274}
{"sheet":"MAIN","index":1,"n_rows":32,"n_cols":6,"rows_kept":32,"cut":false,"hidden":false,"merged":[[25,5,25,8],[27,5,27,8],[15,4,15,8],[11,4,11,8],[16,4,16,8]]}
[]
[]
[]
[]
[]
[]
[]
[]
[]
[]
{"$rows_left_out":23}
{"sheet":"基本情報","index":2,"n_rows":15,"n_cols":8,"rows_kept":15,"cut":false,"hidden":true,"merged":[[9,6,9,8],[11,6,11,8],[12,6,12,8],[13,6,13,8]]}
[]
[null,null,null,null,null,null,"基本情報"]
[]
[]
[]
[null,null,null,"　基本情報"]
[]
[]
[null,null,null,null,null,"作成日"]
[null,null,null,null,null,"事業体名"]
{"$rows_left_out":6}
{"sheet":"入力情報(1)","index":3,"n_rows":45,"n_cols":10,"rows_kept":45,"cut":false,"hidden":true,"merged":[[37,4,37,12],[32,7,32,8],[34,7,34,8],[26,7,26,8],[27,7,27,8],[28,7,28,8],[31,7,31,8],[33,7,33,8],[33,5,33,6],[29,7,29,8],[21,6,21,8],[22,7,22,8],[24,7,24,8],[23,7,23,8],[30,7,30,8],[29,5,29,6],[30,5,30,6],[25,7,25,8]]}
[]
[null,null,null,null,null,null,"入力情報（１）"]
[]
[]
[]
[]
[]
[]
[]
[]
{"$rows_left_out":36}
{"sheet":"入力情報(2)","index":4,"n_rows":41,"n_cols":20,"rows_kept":41,"cut":false,"hidden":true,"merged":[[41,5,41,8],[36,0,36,2],[37,0,37,2],[39,0,39,2],[18,2,18,5],[40,0,40,2],[38,0,38,2],[19,2,21,3],[29,4,29,9],[19,8,19,9],[27,5,27,6],[6,6,6,7],[40,5,40,8],[36,5,36,8],[37,5,37,8],[38,5,38,8],[39,5,39,8],[21,8,21,9],[25,6,25,7],[17,8,17,9],[18,8,18,9],[20,8,20,9],[26,5,26,6]]}
[]
[null,null,null,null,null,null,"入力情報（２）"]
[]
[]
[null,null,null,"Ⅲ.浄水量の情報"]
[null,null,null,null,"16.","更新する場合の浄水量"]
[]
[null,null,null,"Ⅳ.推奨浄水プロセスの情報"]
[null,null,null,null,null,null,"原水レベル","原水レベル","浄水レベル"]
[null,null,null,null,null,null,"現状の原水水質","将来予想される原水水質","要求される浄水水質"]
{"$rows_left_out":32}
{"sheet":"メンテナンスレベル","index":5,"n_rows":29,"n_cols":8,"rows_kept":29,"cut":false,"hidden":true,"merged":[[28,6,28,7],[20,2,23,2],[20,7,23,7],[23,4,23,5],[24,2,27,2],[24,7,27,7],[12,2,15,2],[12,4,12,5],[12,7,15,7],[16,2,19,2],[16,7,19,7],[0,2,1,7],[3,3,3,5],[4,2,7,2],[4,7,7,7],[8,2,11,2],[8,7,11,7],[9,4,9,5]]}
[null,null,"メンテナンスレベルスコア評価基準"]
[]
[null,null,"最も近いと思われる評価レベルをチェックして下さい。全ての評価項目をチェックしないと、評価ポイントは有効となりません。"]
[null,null,"評価項目","評価レベル",null,null,"score","スコア"]
[null,null,"技術スタッフの充実度",null,"維持管理を行うための技術スタッフが必要十分数確保されている",null,100,{"$f":"IF(O5=1,100,IF(O5=2,80,IF(O5=3,40,IF(O5=4,20,0))))","v":0}]
[null,null,null,null,"維持管理を行うための技術スタッフがある程度確保されている",null,80]
[null,null,null,null,"維持管理を行うための技術スタッフが十分ではない。",null,40]
[null,null,null,null,"維持管理を行うための技術スタッフが明らかに不足している。",null,20]
[null,null,"予防保全への取り組み",null,"故障が発生する前に部品交換やオーバーホール等の必要な対応を行っている。",null,100,{"$f":"IF(O9=1,100,IF(O9=2,80,IF(O9=3,40,IF(O9=4,20,0))))","v":0}]
[null,null,null,null,"どちらかというと，故障が発生する前に部品交換やオーバーホール等の必要な対応を行っている。",null,80]
{"$rows_left_out":20}
{"sheet":"プレビュー","index":6,"n_rows":75,"n_cols":10,"rows_kept":75,"cut":false,"hidden":true,"merged":[[28,7,28,8],[45,6,45,7],[65,5,65,8],[61,5,61,8],[62,5,62,8],[63,5,63,8],[64,5,64,8],[71,1,71,12],[21,7,21,8],[18,6,18,8],[19,7,19,8],[25,7,25,8],[20,7,20,8],[22,7,22,8],[23,7,23,8],[24,7,24,8],[54,6,54,7],[26,7,26,8],[60,6,60,7],[30,7,30,8],[29,7,29,8],[27,7,27,8],[43,6,43,7]]}
[]
[]
[]
[]
[null,null,"入力データの確認 及び シミュレート実行"]
[]
[null,null,null,"　基本情報"]
[]
[null,null,null,null,null,"作成日",{"$f":"基本情報!G9","v":"00:00:00"}]
[null,null,null,null,null,"事業体名",{"$f":"基本情報!G10","v":0}]
{"$rows_left_out":66}
{"sheet":"マスター変更","index":7,"n_rows":47,"n_cols":7,"rows_kept":47,"cut":false,"hidden":true,"merged":[[1,0,1,7],[12,1,12,6],[14,1,14,6],[43,1,43,6]]}
[]
["マスター変更"]
[]
[]
[]
[null,"【修繕費】"]
[null,"修繕費補正係数",0.3,"*小数点第2位まで入力可"]
[]
[null,"【設備費】"]
[null,"設備費基準金額",159900,"万円"]
{"$rows_left_out":38}
{"sheet":"参照表","index":8,"n_rows":125,"n_cols":13,"rows_kept":125,"cut":false,"hidden":true,"merged":[[1,0,1,6]]}
[]
[{"$f":"+\"浄水フロー：\"&Cal浄水フロー","v":"浄水フロー：0"}]
[null,{"$f":"\"現在の浄水量（日最大）： \"&TEXT('入力情報(1)'!H23,\"#,###\")","v":"現在の浄水量（日最大）： "},"㎥/日",null,null,null,null,null,null,null,null,null,42]
[null,"　　　　　 規模\n建設(更新)年","土木構造物"]
[null,1900,55744]
[null,1901,55744]
[null,1902,55744]
[null,1903,55744]
[null,1904,55744]
[null,1905,55744]
{"$rows_left_out":116}
{"sheet":"取得金額計算","index":9,"n_rows":125,"n_cols":14,"rows_kept":125,"cut":false,"hidden":true,"merged":[]}
[]
[null,null,null,null,null,null,null,"(単位：千円)"]
[null,null,null,null,null,null,null,null,null,null,null,null,null,41]
[null,"　　　　　規模\n建設年","ﾃﾞﾌﾚｰﾀ","建築構造物","土木構造物","電気設備","機械設備","計装設備"]
[null,1900,{"$f":"+$C$56","v":0.14821508814064968},{"$f":"+$D$56","v":{"$error":"#N/A"}},{"$f":"+$E$56","v":{"$error":"#N/A"}},{"$f":"+$F$56","v":{"$error":"#N/A"}},{"$f":"+$G$56","v":{"$error":"#N/A"}},{"$f":"+$H$56","v":{"$error":"#N/A"}}]
[null,1901,{"$f":"+$C$56","v":0.14821508814064968},{"$f":"+$D$56","v":{"$error":"#N/A"}},{"$f":"+$E$56","v":{"$error":"#N/A"}},{"$f":"+$F$56","v":{"$error":"#N/A"}},{"$f":"+$G$56","v":{"$error":"#N/A"}},{"$f":"+$H$56","v":{"$error":"#N/A"}}]
[null,1902,0.14821508814064968,{"$error":"#N/A"},{"$error":"#N/A"},{"$error":"#N/A"},{"$error":"#N/A"},{"$error":"#N/A"}]
[null,1903,0.14821508814064968,{"$error":"#N/A"},{"$error":"#N/A"},{"$error":"#N/A"},{"$error":"#N/A"},{"$error":"#N/A"}]
[null,1904,0.14821508814064968,{"$error":"#N/A"},{"$error":"#N/A"},{"$error":"#N/A"},{"$error":"#N/A"},{"$error":"#N/A"}]
[null,1905,0.14821508814064968,{"$error":"#N/A"},{"$error":"#N/A"},{"$error":"#N/A"},{"$error":"#N/A"},{"$error":"#N/A"}]
{"$rows_left_out":116}
{"sheet":"Master","index":10,"n_rows":147,"n_cols":52,"rows_kept":147,"cut":false,"hidden":true,"merged":[[17,11,17,13]]}
[null,null,null,null,null,null,null,null,null,null,null,null,null,null,null,null,null,null,null,null,null,null,null,null,null,null,null,null,null,null,null,null,null,null,null,null,null,null,null,null,null,null,null,null,null,null,null,null,null,null,"タイトル","コメント"]
[null,"{Select都道府県}",null,"{Select原水種類}",null,"{Select浄水フロー}",null,null,"{Select粉末炭}",null,"{Select主要設備系列数}",null,"{Selectその他系列名}",null,"{Selectメンテナンス}",null,null,null,"{Select建設年}",null,"{Select濁度G}","{SelectTocG}","{Selectカビ臭G}","{SelectThmfpG}",null,null,"{Rng耐用年数}",null,null,"{RngDef}",null,null,null,"{Mas原浄レベル}",null,null,null,null,null,null,"{Mas濁度除去プロセス}",null,null,null,null,null,null,null,null,"Userform表示","メンテナンスレベル",{"$f":"VLOOKUP(AY2,$AY$13:$AZ$27,2,FALSE)","v":"浄水施設に関してのメンテナンスレベルを自己採点して下さい。\nメンテナンスレベルスコアが高いほど電気設備、機械設備、\n計装設備の更新年数が法定耐用年数より延長するとして\nシミュレーションが行われます。\nまた、故障率が低くなります。\n未入力の場合、メンテナンスレベルスコア360点（中間点）で\n延長係数が計算されます。"}]
[null,null,null,null,null,null,null,null,null,null,null,null,null,null,null,null,null,null,null,null,"■原水レベル■",null,null,null,null,null,null,null,null,"デフレーター",null,null,null,1,2,3,4,5,6,null,1,2,3,4,null,null,null,null,null,null,null,"※｢ﾀｲﾄﾙ｣をｷｰとして、Vlookup参照"]
[null,"都道府県",null,"5.原水種類",null,"6.浄水フロー","分類No.",null,"7.粉末炭の有無",null,"8.主要設備の最小系列数",null,"9.その系列名称",null,"10.メンテナンスポイント",{"$f":"+メンテナンスレベル!G29","v":0},null,null,"建設(更新)年",null,"濁度","TOC","カビ臭","THMFP",null,null,null,"法定耐用年数",null,"（年度）","率",null,null,"Key(種類+項目+入力選択肢)","種類","項目","入力選択肢","レベル","ﾎﾟｲﾝﾄ",null,"Key(ﾌﾟﾛｾｽ+ﾌﾟﾛｾｽCode)","プロセス","ﾌﾟﾛｾｽCode","プロセス名"]
[null,null,null,null,null,null,null,null,null,null,null,null,null,null,null,null,null,null,null,null,null,null,null,null,null,null,"建築構造物",50,null,null,null,null,null,"原水レベル!濁度!0.1度以下","原水レベル","濁度","0.1度以下","低-1",20,null,"濁度除去プロセス!10","濁度除去プロセス",10,"不要",null,"{RngPrintWs}"]
[null,"北海道",null,"ダム放流水",null,"滅菌のみ",null,null,"有",null,1,null,"混和池",null,null,"延長係数(β)","故障率係数(γ)",null,"1950(昭和25)",null,"0.1度以下","1.0mg/L以下","1ng/L以下","0.015mg/L以下",null,null,"土木構造物",60,null,1900,14.811627808188923,null,null,"原水レベル!濁度!0.1度超～1.0度以下","原水レベル","濁度","0.1度超～1.0度以下","低",30,null,"濁度除去プロセス!11","濁度除去プロセス",11,"不要"]
[null,"青森県",null,"ダム水",null,"緩速ろ過",null,null,"無",null,2,null,"フロック形成池",null,"建築構造物",{"$f":"IF(P4>0,(0.4027*LN(P4)-1.0614),0.4027*LN(360)-1.0614)","v":1.3089340934649778},{"$f":"+事故率係数/RngEnchou建築","v":76.398040588340464},null,"1951(昭和26)",null,"0.1度超～1.0度以下","1.0mg/L超～1.5mg/L以下","1ng/L超～3ng/L以下","0.015mg/L超～0.04mg/L以下",null,null,"電気設備",20,null,1901,14.811627808188923,null,null,"原水レベル!濁度!1.0度超～5.0度以下","原水レベル","濁度","1.0度超～5.0度以下","中",40,null,"濁度除去プロセス!12","濁度除去プロセス",12,"不要",null,"基本情報","基本情報"]
[null,"岩手県",null,"表流水",null,"凝集+急速ろ過",3000,null,null,null,3,null,"沈澱池",null,"土木構造物",{"$f":"IF(P4>0,(0.4406*LN(P4)-1.247),0.4406*LN(360)-1.247)","v":1.3464174362569385},{"$f":"+事故率係数/RngEnchou土木","v":74.271171263201666},null,"1952(昭和27)",null,"1.0度超～5.0度以下","1.5mg/L超～2.5mg/L以下","3ng/L超～5ng/L以下","0.04mg/L超～0.07mg/L以下",null,null,"機械設備",15,null,1902,14.811627808188923,null,null,"原水レベル!濁度!5.0度超～800度以下","原水レベル","濁度","5.0度超～800度以下","高",50,null,"濁度除去プロセス!20","濁度除去プロセス",20,"不要",null,"入力情報(1)","入力情報(1)"]
[null,"宮城県",null,"湖沼水",null,"凝集+沈澱+急速ろ過",2100,null,null,null,4,null,"ろ過池",null,"電気設備",{"$f":"IF(P4>0,(0.3483*LN(P4)-0.7184),0.3483*LN(360)-0.7184)","v":1.3317300341540892},{"$f":"+事故率係数/RngEnchou電気","v":75.090294155241224},null,"1953(昭和28)",null,"5.0度超～800度以下","2.5mg/L超～3.5mg/L以下","5ng/L超～25ng/L以下","0.07mg/L超～0.14mg/L以下",null,null,"計装設備",10,null,1903,14.811627808188923,null,null,"原水レベル!濁度!800度超","原水レベル","濁度","800度超","高高",50,null,"濁度除去プロセス!21","濁度除去プロセス",21,"不要",null,"入力情報(2)","入力情報(2)"]
[null,"秋田県",null,"伏流水",null,"凝集+沈澱+粒状炭+急速ろ過",5100,null,null,null,5,null,"その他",null,"機械設備",{"$f":"IF(P4>0,(+ 0.2907*LN(P4)-0.3401),+ 0.2907*LN(360)-0.3401)","v":1.3709904419425603},{"$f":"+事故率係数/RngEnchou機械","v":72.939968755952606},null,"1954(昭和29)",null,"800度超","3.5mg/L超～8.1mg/L以下","25ng/L超～1000ng/L以下","0.14mg/L超",null,null,null,null,null,1904,14.811627808188923,null,null,"原水レベル!TOC!1.0mg/L以下","原水レベル","TOC","1.0mg/L以下","低-2",10,null,"濁度除去プロセス!22","濁度除去プロセス",22,"膜ろ過",null,"メンテナンスレベル","メンテナンスレベル"]
{"$rows_left_out":138}
{"sheet":"Calc","index":11,"n_rows":74,"n_cols":32,"rows_kept":74,"cut":false,"hidden":true,"merged":[[52,12,65,12],[23,12,27,12],[28,12,32,12],[42,12,45,12],[34,12,37,12],[38,12,41,12],[46,12,51,12]]}
[null,null,null,null,null,null,null,null,null,null,null,null,null,null,null,null,"相違項目数"]
[null,null,null,null,null,null,null,null,null,null,null,null,null,null,null,"×",{"$f":"COUNTIF($P$5:$P$68,P2)","v":7},"{RngSouiChk}"]
[null,null,"プロセス選定途中の演算",null,null,null,null,null,null,null,null,null,null,"■シミュレート実行後ﾃﾞｰﾀ保存",null,null,null,null,null,null,null,null,null,null,null,null,null,"■影響水量■"]
[null,null,"Key","原水レベル","浄水レベル","プロセス(原水ﾚﾍﾞﾙ+浄水ﾚﾍﾞﾙ*ｎ)",null,"推奨ﾌﾟﾛｾｽCode",null,null,null,null,null,null,"入力画面",null,"前回格納",null,null,null,null,null,null,null,null,null,null,"電気設備","機械設備","計装設備","最大影響水量","損失額"]
[null,"濁度",{"$f":"IF('入力情報(2)'!T12=1,+'入力情報(2)'!H9&\"!\"&'入力情報(2)'!F11&\"!\"&'入力情報(2)'!H11,IF('入力情報(2)'!T11=1,+'入力情報(2)'!G9&\"!\"&'入力情報(2)'!F11&\"!\"&'入力情報(2)'!G11,0))","v":0},{"$f":"VLOOKUP(C5,Mas原浄レベル,6,FALSE)","v":{"$error":"#N/A"}},{"$f":"VLOOKUP(C12,Mas原浄レベル,6,FALSE)","v":{"$error":"#N/A"}},{"$f":"+D5+E5","v":{"$error":"#N/A"}},null,{"$f":"+B5&\"除去プロセス!\"&F5","v":{"$error":"#N/A"}},null,null,null,null,null,"作成日",{"$f":"プレビュー!G9","v":"00:00:00"},{"$f":"IF(O5=Q5,\"○\",\"×\")","v":"○"}]
[null,"TOC",{"$f":"IF('入力情報(2)'!T12=1,+'入力情報(2)'!H9&\"!\"&'入力情報(2)'!F12&\"!\"&'入力情報(2)'!H12,IF('入力情報(2)'!T11=1,+'入力情報(2)'!G9&\"!\"&'入力情報(2)'!F12&\"!\"&'入力情報(2)'!G12,0))","v":0},{"$f":"VLOOKUP(C6,Mas原浄レベル,6,FALSE)","v":{"$error":"#N/A"}},{"$f":"VLOOKUP(C13,Mas原浄レベル,6,FALSE)","v":{"$error":"#N/A"}},{"$f":"(+D6+E6)*10","v":{"$error":"#N/A"}},null,{"$f":"+B6&\"除去プロセス!\"&F6","v":{"$error":"#N/A"}},null,"ｶｰｿﾙ移動設定",false,null,null,"事業体名",{"$f":"プレビュー!G10","v":0},"○"]
[null,"カビ臭",{"$f":"IF('入力情報(2)'!T12=1,+'入力情報(2)'!H9&\"!\"&'入力情報(2)'!F13&\"!\"&'入力情報(2)'!H13,IF('入力情報(2)'!T11=1,+'入力情報(2)'!G9&\"!\"&'入力情報(2)'!F13&\"!\"&'入力情報(2)'!G13,0))","v":0},{"$f":"VLOOKUP(C7,Mas原浄レベル,6,FALSE)","v":{"$error":"#N/A"}},{"$f":"VLOOKUP(C14,Mas原浄レベル,6,FALSE)","v":{"$error":"#N/A"}},{"$f":"(+D7+E7)*100","v":{"$error":"#N/A"}},null,{"$f":"+B7&\"除去プロセス!\"&F7","v":{"$error":"#N/A"}},null,"移動方向",-4121,null,null,"所在地",{"$f":"プレビュー!G11","v":"　"},"×"]
[null,"THM",{"$f":"IF('入力情報(2)'!T12=1,+'入力情報(2)'!H9&\"!\"&'入力情報(2)'!F14&\"!\"&'入力情報(2)'!H14,IF('入力情報(2)'!T11=1,+'入力情報(2)'!G9&\"!\"&'入力情報(2)'!F14&\"!\"&'入力情報(2)'!G14,0))","v":0},{"$f":"VLOOKUP(C8,Mas原浄レベル,6,FALSE)","v":{"$error":"#N/A"}},{"$f":"VLOOKUP(C15,Mas原浄レベル,6,FALSE)","v":{"$error":"#N/A"}},{"$f":"(+D8+E8)*1000","v":{"$error":"#N/A"}},null,{"$f":"+B8&\"除去プロセス!\"&F8","v":{"$error":"#N/A"}},null,null,null,null,null,"記入者",{"$f":"プレビュー!G12","v":0},"○"]
[null,null,null,null,null,null,null,null,null,null,null,null,null,"所属",{"$f":"プレビュー!G13","v":0},"○"]
[null,null,"プロセス選定",null,null,null,null,null,null,null,null,null,null,"連絡先",{"$f":"プレビュー!G14","v":0},"○"]
{"$rows_left_out":65}
{"sheet":"経年故障率表","index":12,"n_rows":197,"n_cols":21,"rows_kept":197,"cut":false,"hidden":true,"merged":[]}
[null,null,null,"耐用年数","更新率","故障率",null,null,null,null,"耐用年数","更新率","故障率",null,null,null,null,"耐用年数","更新率","故障率"]
[null,null,null,null,{"$f":"+RngEnchou機械","v":1.3709904419425603},1.37,null,null,null,null,null,{"$f":"+RngEnchou電気","v":1.3317300341540892},1.33,null,null,null,null,null,{"$f":"+RngEnchou計装","v":1.3337090957867057},1.33]
[null,"(年)",null,{"$f":"+Master!AB8","v":15},{"$f":"ROUND(+D3*E2,0)","v":21},{"$f":"ROUND(+D3*F2,0)+1","v":22},null,null,"(年)",null,{"$f":"+Master!AB7","v":20},{"$f":"ROUND(+K3*L2,0)","v":27},{"$f":"ROUND(+K3*M2,0)+1","v":28},null,null,"(年)",null,{"$f":"+Master!AB9","v":10},{"$f":"ROUND(+R3*S2,0)","v":13},{"$f":"ROUND(+R3*T2,0)+1","v":14}]
[]
[]
[]
[]
[null,null,null,"■リスク損害額"]
[]
[]
{"$rows_left_out":188}
{"sheet":"健全度","index":13,"n_rows":62,"n_cols":24,"rows_kept":62,"cut":false,"hidden":true,"merged":[]}
[]
[]
[]
[]
[null,"健全度評価結果"]
[]
[]
[null,"建築構造物",null,null,null,null,null,null,null,null,null,"単位：百万円",null,"土木構造物",null,null,null,null,null,null,null,null,null,"単位：百万円"]
[]
[null,"健全資産",null,null,null,null,null,null,null,null,null,null,null,"健全資産"]
{"$rows_left_out":53}
{"sheet":"影響水量","index":14,"n_rows":45,"n_cols":13,"rows_kept":45,"cut":false,"hidden":true,"merged":[]}
[]
[]
[]
[]
[]
[]
[]
[]
[null,"■リスク　影響水量"]
[]
{"$rows_left_out":36}
{"sheet":"損失額","index":15,"n_rows":49,"n_cols":13,"rows_kept":49,"cut":false,"hidden":true,"merged":[]}
[]
[]
[]
[]
[]
[]
[]
[]
[null,"■リスク　損失額"]
[]
{"$rows_left_out":40}
{"sheet":"修繕更新費用S1","index":16,"n_rows":54,"n_cols":28,"rows_kept":54,"cut":false,"hidden":true,"merged":[]}
[]
[]
[]
[]
[]
[]
[]
[]
[null,"■修繕及び更新費用"]
[]
{"$rows_left_out":45}
{"sheet":"修繕更新費用S2","index":17,"n_rows":54,"n_cols":20,"rows_kept":54,"cut":false,"hidden":true,"merged":[[15,1,19,1],[20,1,22,1],[23,1,23,2],[15,18,19,18],[20,18,22,18]]}
[]
[]
[]
[]
[]
[]
[]
[]
[null,"■修繕及び更新費用"]
[]
{"$rows_left_out":45}
{"sheet":"修繕更新費用S3","index":18,"n_rows":51,"n_cols":14,"rows_kept":51,"cut":false,"hidden":true,"merged":[[15,1,19,1],[20,1,22,1],[23,1,23,2]]}
[]
[]
[]
[]
[]
[]
[]
[]
[null,"■修繕及び更新費用"]
[]
{"$rows_left_out":42}
{"sheet":"修繕更新費用S4","index":19,"n_rows":54,"n_cols":20,"rows_kept":54,"cut":false,"hidden":true,"merged":[[15,1,19,1],[20,1,22,1],[23,1,23,2],[15,18,19,18],[20,18,22,18]]}
[]
[]
[]
[]
[]
[]
[]
[]
[null,"■修繕及び更新費用"]
[]
{"$rows_left_out":45}
{"sheet":"修繕更新費用S5","index":20,"n_rows":51,"n_cols":14,"rows_kept":51,"cut":false,"hidden":true,"merged":[[15,1,19,1],[20,1,22,1],[23,1,23,2]]}
[]
[]
[]
[]
[]
[]
[]
[]
[null,"■修繕及び更新費用"]
[]
{"$rows_left_out":42}
{"sheet":"出力まとめの表","index":21,"n_rows":76,"n_cols":25,"rows_kept":76,"cut":false,"hidden":true,"merged":[]}
[]
[]
[]
[null,null,null,{"$f":"+\"浄水場名：\"&'入力情報(1)'!G22","v":"浄水場名："}]
[null,null,null,"50年間の費用で比較"]
[null,null,null,"設備ごとの係数","建築構造物","土木構造物","電気設備","機械設備","計装設備"]
[null,null,null,"延長係数β",{"$f":"RngEnchou建築","v":1.3089340934649778},{"$f":"RngEnchou土木","v":1.3464174362569385},{"$f":"RngEnchou電気","v":1.3317300341540892},{"$f":"RngEnchou機械","v":1.3709904419425603},{"$f":"RngEnchou計装","v":1.3337090957867057}]
[]
[null,null,null,"シナリオの条件","シナリオ1\n（修繕のみ）","シナリオ２\n（現状と同じフロー・\n規模で更新）","シナリオ3\n（希望フロー・\n同じ規模で更新）","シナリオ4\n（現状と同じフロー・\n将来予測規模で更新）","シナリオ5\n（希望フロー・\n将来予測規模で更新）",null,null,null,null,null,null,null,null,null,null,"s","s",null,"s"]
[null,null,null,"実際の浄水量 m3/日",{"$f":"+'入力情報(1)'!H23","v":0},{"$f":"+'入力情報(1)'!H23","v":0},{"$f":"+'入力情報(1)'!H23","v":0},{"$f":"+'入力情報(2)'!H6","v":0},{"$f":"+'入力情報(2)'!H6","v":0},null,null,null,null,null,null,null,null,null,null,"シナリオ1","シナリオ２","シナリオ3","シナリオ4","シナリオ5"]
{"$rows_left_out":67}
{"sheet":"系列の集計","index":22,"n_rows":102,"n_cols":19,"rows_kept":102,"cut":false,"hidden":true,"merged":[]}
[]
[null,null,null,null,"←　合計のみを表示する"]
[]
[]
[null,null,null,"50年間の費用で比較"]
[null,null,null,"シナリオの条件","シナリオ1\n（修繕のみ）","シナリオ２\n（現状と同じフロー・\n規模で更新）","シナリオ3\n（希望フロー・\n同じ規模で更新）","シナリオ4\n（現状と同じフロー・\n将来予測規模で更新）","シナリオ5\n（希望フロー・\n将来予測規模で更新）"]
[null,null,null,"ｼﾅﾘｵ選択ｶｳﾝﾄ",{"$f":"COUNT(E10:E14)","v":0},{"$f":"COUNT(F10:F14)","v":0},{"$f":"COUNT(G10:G14)","v":0},{"$f":"COUNT(H10:H14)","v":0},{"$f":"COUNT(I10:I14)","v":0}]
[]
[null,null,null,"修繕費",{"$f":"SUM(E10:E14)","v":0},{"$f":"SUM(F10:F14)","v":0},{"$f":"SUM(G10:G14)","v":0},{"$f":"SUM(H10:H14)","v":0},{"$f":"SUM(I10:I14)","v":0},"億円",null,null,null,null,null,null,null,null,"行非表示判定"]
[null,null,null,null,null,null,null,null,null,null,null,null,null,null,null,null,null,null,{"$f":"COUNT(E10:I10)","v":0}]
{"$rows_left_out":93}
{"sheet":"設備費と運転費","index":23,"n_rows":55,"n_cols":20,"rows_kept":55,"cut":false,"hidden":true,"merged":[[18,2,18,3],[36,2,36,3],[3,5,4,5],[2,6,6,6]]}
[]
[null,"前提条件","分類No.2100（凝集・沈澱＋急速ろ過）、浄水量20,000m3/dを基準とする。"]
[null,"この時の","設備費基準額",159900,"万円/20000m3・d",null,"e-WaterⅡ最終報告書、pp.Ⅱ-201～Ⅱ-214より読みとったもの"]
[null,null,"設備費の規模係数k1",{"$f":"(3201-(0.01*D3))/(100000-20000)","v":2.0025000000000001E-2},null,"5,000m3/dから100,000m3/dの\n原単位の変化率\n＝2.0÷(100000-5000)",null,null,"No.2100のみ適用"]
[null,null,"設備費規模計算式の切片",{"$f":"3201-D4*100000","v":1198.5}]
[]
[null,null,"基準給水原価",170,"円/m3","マスターの変更がなければ180円/m3を基本とする。水道統計の全国平均180円/m3（H17年度）",null,"浄水処理分以外も含まれるが、内訳中のその他を加味しないことで相殺されると仮定"]
[]
[null,null,"変動費係数",0.13,null,"マスターの変更がなければ、給水原価の10%とする（水道統計H17年度全国平均）"]
[null,null,"運転費単価の変動費分\n（人件費を除く）",{"$f":"D7*D9","v":22.1},"円/m3","給水原価×変動費係数"]
{"$rows_left_out":45}